Target
Melanin-concentrating hormone receptor 1 [E4Q,A5T]
Ligand
BDBM258776
Substrate
Meas. Tech.
Radioligand Binding Assay
pH
7.4±n/a
Ki
0.7±n/a nM
Comments
extracted
Citation
 Washburn, WNMurugaiah Subbaiah, MAAhmad, S Pyrrolone or pyrrolidinone melanin concentrating hormone receptor-1 antagonists US Patent  US9499482 Publication Date 11/22/2016 
Target
Name:
Melanin-concentrating hormone receptor 1 [E4Q,A5T]
Synonyms:
GPR24 MCHR1_HUMAN SLC1
Type:
Enzyme
Mol. Mass.:
46077.38
Organism:
Homo sapiens (Human)
Description:
Q99705 (E4Q, A5T)
Residue:
422
  
Inhibitor
Name:
BDBM258776
Synonyms:
US9499482, 176
Type:
Small organic molecule
Emp. Form.:
C28H34N2O4
Mol. Mass.:
462.5806
SMILES:
CCc1cc(ccc1OCCN1CCC[C@H](O)C1)N1CC=C(Oc2ccc(cc2)C2CC2)C1=O
: