Target
Carbonic anhydrase 2
Ligand
BDBM258852
Substrate
Meas. Tech.
Carbonic Anhydrase Assay
pH
7.4±n/a
Temperature
298.15±n/a K
IC50
>10000±n/a nM
Comments
extracted
Citation
 Lücking, UKosemund, DBohlmann, RScholz, ALienau, PSiemeister, GBömer, U 4-(ortho)-fluorophenyl-5-fluoropyrimidin-2-yl amines containing a sulfoximine group US Patent  US9499492 Publication Date 11/22/2016 
Target
Name:
Carbonic anhydrase 2
Synonyms:
CA-II CAC Carbonate dehydratase II Carbonic anhydrase 2 (CA-II) Carbonic anhydrase C Carbonic anhydrase II (CA-II) Carbonic anhydrase II (hCA II) | Carbonic anhydrase isoenzyme II (hCA II)
Type:
Enzyme
Mol. Mass.:
29250.71
Organism:
Homo sapiens (Human)
Description:
P00918
Residue:
260
  
Inhibitor
Name:
BDBM258852
Synonyms:
US9499492, 4
Type:
Small organic molecule
Emp. Form.:
C19H14F6N4OS
Mol. Mass.:
460.396
SMILES:
CS(=N)(=O)Cc1cc(Nc2ncc(F)c(n2)-c2ccc(F)cc2F)cc(c1)C(F)(F)F
: