Target
Tyrosine-protein kinase BTK
Ligand
BDBM259434
Substrate
Meas. Tech.
Biochemical Enzyme Assay
pH
7.5±n/a
Temperature
303.15±n/a K
IC50
1±n/a nM
Comments
extracted
Citation
 Angst, DGessier, FVulpetti, A Amino pyrimidine derivatives US Patent  US9512084 Publication Date 12/6/2016 
Target
Name:
Tyrosine-protein kinase BTK
Synonyms:
AGMX1 Agammaglobulinaemia tyrosine kinase B cell progenitor kinase BPK BTK_HUMAN Tyrosine Kinase BTK Tyrosine-protein kinase BTK (BTK)
Type:
Enzyme
Mol. Mass.:
76289.95
Organism:
Homo sapiens (Human)
Description:
Q06187
Residue:
659
  
Inhibitor
Name:
BDBM259434
Synonyms:
US10457647, Example 33 US11673868, Example 33 | US9512084, 33
Type:
Small organic molecule
Emp. Form.:
C28H27F2N5O3
Mol. Mass.:
519.5425
SMILES:
Cc1c(NC(=O)c2ccc(cc2F)C2CC2)cc(F)cc1-c1ncnc(N)c1OC[C@@H]1CCN1C(=O)C=C
: