Target
Cyclin-dependent kinase 4/G1/S-specific cyclin-D1
Ligand
BDBM6710
Substrate
ING Peptide
Meas. Tech.
CDK Kinase Inhibition Assay
pH
7±n/a
Temperature
295.15±n/a K
IC50
69±n/a nM
Citation
 Al-awar, RSRay, JEHecker, KAJoseph, SHuang, JShih, CBrooks, HBSpencer, CDWatkins, SASchultz, RMConsidine, ELFaul, MMSullivan, KAKolis, SPCarr, MAZhang, F Preparation of novel aza-1,7-annulated indoles and their conversion to potent indolocarbazole kinase inhibitors. Bioorg Med Chem Lett 14:3925-8 (2004)  
Target
Name:
Cyclin-dependent kinase 4/G1/S-specific cyclin-D1
Synonyms:
CDK4/CycD CDK4/Cyclin D1 Cyclin-Dependent Kinase 4 (CDK4) Cyclin-dependent kinase 4/G1/S-specific cyclin D1 | Cyclin-dependent kinase 4/cyclin D1
Type:
Protein Complex
Mol. Mass.:
Description:
CDK4/D1 complexes were purified from insect cells co-infected with baculovirus vectors containing each of the components.
Components:
This complex has 2 components.
Component 1
Name:
Cyclin-dependent kinase 4
Synonyms:
CDK4 Cell division protein kinase 4 PSK-J3
Type:
Enzyme Subunit
Mol. Mass.:
33731.96
Organism:
Homo sapiens (Human)
Description:
P11802
Residue:
303
  
Component 2
Name:
G1/S-specific cyclin-D1
Synonyms:
B-cell lymphoma 1 protein BCL-1 oncogene CCND1 PRAD1 | PRAD1 oncogene
Type:
Enzyme Subunit
Mol. Mass.:
33717.70
Organism:
Homo sapiens (Human)
Description:
Residue:
295
  
Inhibitor
Name:
BDBM6710
Synonyms:
7-(trifluoromethyl)-1,4,14,24-tetraazaheptacyclo[16.8.1.0^{2,17}.0^{3,11}.0^{5,10}.0^{12,16}.0^{22,27}]heptacosa-2(17),3(11),5(10),6,8,12(16),18(27),19,21-nonaene-13,15-dione hydrochloride | aza-1,7-annulated indole deriv. 12e
Type:
Small organic molecule
Emp. Form.:
C24H15F3N4O2
Mol. Mass.:
448.3967
SMILES:
FC(F)(F)c1ccc2c(c1)[nH]c1c2c2C(=O)NC(=O)c2c2c3cccc4CNCCn(c34)c12
:
Substrate
Name:
ING Peptide
Synonyms:
Type:
Peptide
Mol. Mass.:
1341.50
Organism:
Description:
amino acid residues 246-257 from human retinoblastoma 1 protein.
Residue:
12
INGSPRTPRRGQ