Target
Dual specificity protein kinase TTK/Glutathione S-transferase P
Ligand
BDBM259465
Substrate
Meas. Tech.
Time-Resolved Fluorescence Resonance Energy Transfer (TR-FRET) Assay
pH
7.7±n/a
Temperature
295.15±n/a K
IC50
0.6±n/a nM
Comments
extracted
Citation
 Koppitz, MKlar, UWengner, AMNeuhaus, RSiemeister, G Substituted imidazopyridazines US Patent  US9512126 Publication Date 12/6/2016 
Target
Name:
Dual specificity protein kinase TTK/Glutathione S-transferase P
Synonyms:
GST-Dual specificity protein kinase TTK
Type:
Protein
Mol. Mass.:
Description:
Components:
This complex has 2 components.
Component 1
Name:
Glutathione S-transferase P
Synonyms:
FAEES3 GST3 GSTP1-1 Glutathione S-transferase Glutathione S-transferase P Glutathione transferase (GST)
Type:
Enzyme
Mol. Mass.:
23353.53
Organism:
Homo sapiens (Human)
Description:
P09211
Residue:
210
  
Component 2
Name:
Dual specificity protein kinase TTK
Synonyms:
Dual specificity protein kinase (TTK) MPS1 Monopolar Spindle 1 (MPS1) Monopolar Spindle 1 Kinase (MPS1) TTK | TTK_HUMAN
Type:
Protein
Mol. Mass.:
97086.79
Organism:
Homo sapiens (Human)
Description:
P33981
Residue:
857
  
Inhibitor
Name:
BDBM259465
Synonyms:
US9512126, 2
Type:
Small organic molecule
Emp. Form.:
C28H25F6N5O2
Mol. Mass.:
577.5208
SMILES:
COc1ccc(cc1F)C(F)(F)c1cc(NCCC(F)(F)F)c2ncc(-c3ccc(C(=O)NC4CC4)c(C)c3)n2n1
: