Target
Poly [ADP-ribose] polymerase 2
Ligand
BDBM50446537
Substrate
Meas. Tech.
Biochemical Assay
IC50
1760±n/a nM
Citation
 Bregman, HBuchanan, JLChakka, NDimauro, EFGunaydin, HGuzman-Perez, AHua, ZHuang, X Quinazolinone compounds and derivatives thereof US Patent  US9505749 Publication Date 11/29/2016 
Target
Name:
Poly [ADP-ribose] polymerase 2
Synonyms:
(ARTD2 or PARP2) ADPRTL2 PARP2_HUMAN Poly [ADP-ribose] polymerase 2 (PARP2)
Type:
Enzyme
Mol. Mass.:
66225.70
Organism:
Homo sapiens (Human)
Description:
Q9UGN5
Residue:
583
  
Inhibitor
Name:
BDBM50446537
Synonyms:
CHEMBL3110100 | US9505749, 106
Type:
Small organic molecule
Emp. Form.:
C24H24N4O3S
Mol. Mass.:
448.537
SMILES:
O=C(CCSc1nc2ccccc2c(=O)[nH]1)N[C@H]1CC[C@@H](CC1)Oc1ccc(cc1)C#N
: