Target
Cannabinoid receptor 1
Ligand
BDBM259697
Substrate
Meas. Tech.
cAMP Assay
Temperature
310.15±n/a K
EC50
>10000±n/a nM
Comments
extracted
Citation
 Bendels, SGrether, UKimbara, ANettekoven, MRoever, SRogers-Evans, MSchulz-Gasch, T Purine derivatives as CB2 receptor agonists US Patent  US9505762 Publication Date 11/29/2016 
Target
Name:
Cannabinoid receptor 1
Synonyms:
CANN6 CB-R CNR CNR1_HUMAN Cannabinoid receptor Cannabinoid receptor 1 (brain)
Type:
G Protein-Coupled Receptor (GPCR)
Mol. Mass.:
52868.96
Organism:
Homo sapiens (Human)
Description:
P21554
Residue:
472
  
Inhibitor
Name:
BDBM259697
Synonyms:
US9505762, 65
Type:
Small organic molecule
Emp. Form.:
C21H26ClN5O
Mol. Mass.:
399.917
SMILES:
CC(C)(C)c1nc(N2CCC(C)(O)C2)c2ncn(Cc3cccc(Cl)c3)c2n1
: