Target
Cannabinoid receptor 1
Ligand
BDBM259730
Substrate
Meas. Tech.
cAMP Assay
Temperature
310.15±n/a K
EC50
>10000±n/a nM
Comments
extracted
Citation
 Bendels, SGrether, UKimbara, ANettekoven, MRoever, SRogers-Evans, MSchulz-Gasch, T Purine derivatives as CB2 receptor agonists US Patent  US9505762 Publication Date 11/29/2016 
Target
Name:
Cannabinoid receptor 1
Synonyms:
CANN6 CB-R CNR CNR1_HUMAN Cannabinoid receptor Cannabinoid receptor 1 (brain)
Type:
G Protein-Coupled Receptor (GPCR)
Mol. Mass.:
52868.96
Organism:
Homo sapiens (Human)
Description:
P21554
Residue:
472
  
Inhibitor
Name:
BDBM259730
Synonyms:
US9505762, 98
Type:
Small organic molecule
Emp. Form.:
C18H22F3N7O
Mol. Mass.:
409.4088
SMILES:
CC(C)(C)c1nc(N2CC[C@H](O)C2)c2ncn(Cc3c[nH]nc3C(F)(F)F)c2n1
: