Target
Ribosomal protein S6 kinase alpha-3 [399-740,C436V]
Ligand
BDBM259821
Substrate
Meas. Tech.
RSK2 Inhibition Assay
pH
8±n/a
Temperature
295.15±n/a K
IC50
150000±n/a nM
Comments
extracted
Citation
 Taunton, Jr., JWMaglathlin, RSerafimova, ICohen, MSMiller, RPaavilainen, VMcFarland, JKrishnan, S Kinase inhibitors US Patent  US9505766 Publication Date 11/29/2016 
Target
Name:
Ribosomal protein S6 kinase alpha-3 [399-740,C436V]
Synonyms:
ISPK1 MAPKAPK1B RSK2 | Ribosomal S6 kinase 2 (RSK-2)(C436V)
Type:
Enzyme
Mol. Mass.:
38431.12
Organism:
Homo sapiens (Human)
Description:
aa 399-740; RSK2 C-terminal kinase domain (CTD)
Residue:
342
  
Inhibitor
Name:
BDBM259821
Synonyms:
US9505766, 22
Type:
Small organic molecule
Emp. Form.:
C15H11N3O
Mol. Mass.:
249.2673
SMILES:
NC(=O)C(=C\c1ccc(cc1)-c1ccncc1)\C#N
: