Target
Serine/threonine-protein kinase PLK1
Ligand
BDBM259838
Substrate
Meas. Tech.
Inhibition Assay
pH
7.6±n/a
Temperature
298.15±n/a K
IC50
10000±n/a nM
Comments
extracted
Citation
 Taunton, Jr., JWMaglathlin, RSerafimova, ICohen, MSMiller, RPaavilainen, VMcFarland, JKrishnan, S Kinase inhibitors US Patent  US9505766 Publication Date 11/29/2016 
Target
Name:
Serine/threonine-protein kinase PLK1
Synonyms:
PLK PLK1 Polo-like kinase 1 (PlK1) STPK13 Serine/threonine-protein kinase 13 | polo-like kinase
Type:
Serine/threonine-protein kinase
Mol. Mass.:
68277.16
Organism:
Homo sapiens (Human)
Description:
P53350
Residue:
603
  
Inhibitor
Name:
BDBM259838
Synonyms:
US9505766, 42
Type:
Small organic molecule
Emp. Form.:
C22H22N4O4
Mol. Mass.:
406.4345
SMILES:
COc1cc(cc(OC)c1OC)-c1n[nH]c2ccc(\C=C(/C#N)C(=O)N(C)C)cc12
: