Target
Proto-oncogene tyrosine-protein kinase Src
Ligand
BDBM259849
Substrate
Meas. Tech.
Kinase Assay
pH
7.4±n/a
Temperature
298.15±n/a K
IC50
>5000±n/a nM
Comments
extracted
Citation
 Taunton, Jr., JWMaglathlin, RSerafimova, ICohen, MSMiller, RPaavilainen, VMcFarland, JKrishnan, S Kinase inhibitors US Patent  US9505766 Publication Date 11/29/2016 
Target
Name:
Proto-oncogene tyrosine-protein kinase Src
Synonyms:
Calmodulin/Proto-oncogene tyrosine-protein kinase Src Proto-oncogene c-Src SRC SRC_HUMAN V-src sarcoma (Schmidt-Ruppin A-2) viral oncogene homolog (avian) p60-Src | pp60c-src
Type:
Protein
Mol. Mass.:
59838.60
Organism:
Homo sapiens (Human)
Description:
P12931
Residue:
536
  
Inhibitor
Name:
BDBM259849
Synonyms:
US9505766, 53
Type:
Small organic molecule
Emp. Form.:
C25H19ClN6O
Mol. Mass.:
454.911
SMILES:
Nc1ncnc2n(cc(-c3ccc(Cl)cc3)c12)-c1cccc(\C=C(/C#N)C(=O)N2CCC2)c1
: