Target
Proto-oncogene tyrosine-protein kinase Src [S345C]
Ligand
BDBM259847
Substrate
Meas. Tech.
Kinase Assay
pH
7.4±n/a
Temperature
298.15±n/a K
IC50
520±n/a nM
Comments
extracted
Citation
 Taunton, Jr., JWMaglathlin, RSerafimova, ICohen, MSMiller, RPaavilainen, VMcFarland, JKrishnan, S Kinase inhibitors US Patent  US9505766 Publication Date 11/29/2016 
Target
Name:
Proto-oncogene tyrosine-protein kinase Src [S345C]
Synonyms:
Proto-oncogene c-Src (S345C) SRC1 | SRC_HUMAN
Type:
Enzyme
Mol. Mass.:
59854.66
Organism:
Homo sapiens (Human)
Description:
P12931 (S345C)
Residue:
536
  
Inhibitor
Name:
BDBM259847
Synonyms:
US9505766, 51
Type:
Small organic molecule
Emp. Form.:
C22H15ClN6O
Mol. Mass.:
414.847
SMILES:
NC(=O)C(=C\c1cccc(c1)-n1cc(-c2ccc(Cl)cc2)c2c(N)ncnc12)\C#N
: