Target
Ribosomal protein S6 kinase alpha-3 [399-740]
Ligand
BDBM259870
Substrate
Meas. Tech.
RSK2 Inhibition Assay
pH
8±n/a
Temperature
295.15±n/a K
IC50
4.8±n/a nM
Comments
extracted
Citation
 Taunton, Jr., JWMaglathlin, RSerafimova, ICohen, MSMiller, RPaavilainen, VMcFarland, JKrishnan, S Kinase inhibitors US Patent  US9505766 Publication Date 11/29/2016 
Target
Name:
Ribosomal protein S6 kinase alpha-3 [399-740]
Synonyms:
ISPK1 MAPKAPK1B RSK2 | Ribosomal S6 kinase 2 (RSK-2)
Type:
Enzyme
Mol. Mass.:
38435.14
Organism:
Homo sapiens (Human)
Description:
aa 399-740; RSK2 C-terminal kinase domain (CTD)
Residue:
342
  
Inhibitor
Name:
BDBM259870
Synonyms:
US9505766, 75
Type:
Small organic molecule
Emp. Form.:
C22H25N7O2
Mol. Mass.:
419.4796
SMILES:
CN(C)NC(=O)C(=C\c1c(-c2ccc(C)cc2)c2c(N)ncnc2n1CCCO)\C#N
: