Target
Glutaminyl-peptide cyclotransferase
Ligand
BDBM259904
Substrate
Meas. Tech.
Fluorometric Assays
pH
6±n/a
Temperature
303.15±n/a K
Ki
9.8306±n/a nM
Comments
extracted
Citation
 Heiser, UBuchholz, MSommer, RMeyer, ADemuth, H Inhibitors US Patent  US9512115 Publication Date 12/6/2016 
Target
Name:
Glutaminyl-peptide cyclotransferase
Synonyms:
Glutaminyl Cyclase Glutaminyl-peptide cyclotransferase Glutaminyl-tRNA cyclotransferase QPCT | QPCT_HUMAN
Type:
Enzyme
Mol. Mass.:
40877.05
Organism:
Homo sapiens (Human)
Description:
Q16769
Residue:
361
  
Inhibitor
Name:
BDBM259904
Synonyms:
US9512115, 7
Type:
Small organic molecule
Emp. Form.:
C20H19F2N3O3
Mol. Mass.:
387.38
SMILES:
CC(C)(F)COc1ccc([C@H]2COC(=O)N2c2ccc3[nH]cnc3c2)c(F)c1
: