Target
Glutaminyl-peptide cyclotransferase
Ligand
BDBM259914
Substrate
Meas. Tech.
Fluorometric Assays
pH
8±n/a
Temperature
303.15±n/a K
Ki
2.9232±n/a nM
Comments
extracted
Citation
 Heiser, UBuchholz, MSommer, RMeyer, ADemuth, H Inhibitors US Patent  US9512115 Publication Date 12/6/2016 
Target
Name:
Glutaminyl-peptide cyclotransferase
Synonyms:
Glutaminyl Cyclase Glutaminyl-peptide cyclotransferase Glutaminyl-tRNA cyclotransferase QPCT | QPCT_HUMAN
Type:
Enzyme
Mol. Mass.:
40877.05
Organism:
Homo sapiens (Human)
Description:
Q16769
Residue:
361
  
Inhibitor
Name:
BDBM259914
Synonyms:
US9512115, 18
Type:
Small organic molecule
Emp. Form.:
C20H17F3N4O2
Mol. Mass.:
402.3698
SMILES:
Fc1cc(ccc1[C@H]1COC(=O)N1c1ccc2[nH]cnc2c1)N1CCC(F)(F)C1
: