Target
Hepatocyte growth factor receptor
Ligand
BDBM259954
Substrate
Meas. Tech.
Inhibition Assay
Temperature
293.15±n/a K
IC50
484.8±n/a nM
Comments
extracted
Citation
 Zhao, ZWang, HWu, CQi, Q [1,2,4] triazol [4,3-A] pyridine derivative, preparation method therefor or medical application thereof US Patent  US9512121 Publication Date 12/6/2016 
Target
Name:
Hepatocyte growth factor receptor
Synonyms:
Hepatocyte growth factor receptor Hepatocyte growth factor receptor (c-MET) MET Met proto-oncogene (hepatocyte growth factor receptor) Tyrosine-protein kinase Met (c-Met) c-Met kinase
Type:
Protein
Mol. Mass.:
155559.73
Organism:
Homo sapiens (Human)
Description:
P08581
Residue:
1390
  
Inhibitor
Name:
BDBM259954
Synonyms:
US9512121, 38
Type:
Small organic molecule
Emp. Form.:
C25H22N8O2S
Mol. Mass.:
498.56
SMILES:
COc1cc(cn2c(Sc3ccc4ncc(-c5cnn(C)c5)c(OC)c4c3)nnc12)-c1cnn(C)c1
: