Target
Cannabinoid receptor 2
Ligand
BDBM259971
Substrate
Meas. Tech.
cAMP Assay
Temperature
310.15±n/a K
EC50
1.1±n/a nM
Comments
extracted
Citation
 Grether, UKimbara, AMatthias, NFabienne, RStephan, RRogers-Evans, MSchulz-Gasch, T Pyrazole compounds as CB2 agonists US Patent  US9512132 Publication Date 12/6/2016 
Target
Name:
Cannabinoid receptor 2
Synonyms:
CANNABINOID CB2 CB2 CB2B CNR2_HUMAN Cannabinoid CB2 receptor Cannabinoid receptor 2 (CB2R) | hCB2
Type:
G Protein-Coupled Receptor (GPCR)
Mol. Mass.:
39690.94
Organism:
Homo sapiens (Human)
Description:
P34972
Residue:
360
  
Inhibitor
Name:
BDBM259971
Synonyms:
US9512132, 7
Type:
Small organic molecule
Emp. Form.:
C21H22F5N5
Mol. Mass.:
439.4249
SMILES:
CC(C)(C)c1nc(N2CCC(F)(F)C2)c2cnn(Cc3ccccc3C(F)(F)F)c2n1
: