Target
Cannabinoid receptor 2
Ligand
BDBM259997
Substrate
Meas. Tech.
cAMP Assay
Temperature
310.15±n/a K
EC50
8.8±n/a nM
Comments
extracted
Citation
 Grether, UKimbara, AMatthias, NFabienne, RStephan, RRogers-Evans, MSchulz-Gasch, T Pyrazole compounds as CB2 agonists US Patent  US9512132 Publication Date 12/6/2016 
Target
Name:
Cannabinoid receptor 2
Synonyms:
CANNABINOID CB2 CB2 CB2B CNR2_HUMAN Cannabinoid CB2 receptor Cannabinoid receptor 2 (CB2R) | hCB2
Type:
G Protein-Coupled Receptor (GPCR)
Mol. Mass.:
39690.94
Organism:
Homo sapiens (Human)
Description:
P34972
Residue:
360
  
Inhibitor
Name:
BDBM259997
Synonyms:
US9512132, 33
Type:
Small organic molecule
Emp. Form.:
C18H25N9O
Mol. Mass.:
383.4508
SMILES:
CC(C)(C)c1nc(N2CC[C@H](O)C2)c2cnn(Cc3nnnn3C3CC3)c2n1
: