Target
Cannabinoid receptor 1
Ligand
BDBM260034
Substrate
Meas. Tech.
cAMP Assay
Temperature
310.15±n/a K
EC50
>10000±n/a nM
Comments
extracted
Citation
 Dhurwasulu, BGrether, UNettekoven, MRoever, SRogers-Evans, MSchulz-Gasch, T Pyrazine derivatives as CB2 receptor agonists US Patent  US9512141 Publication Date 12/6/2016 
Target
Name:
Cannabinoid receptor 1
Synonyms:
CANN6 CB-R CNR CNR1_HUMAN Cannabinoid receptor Cannabinoid receptor 1 (brain)
Type:
G Protein-Coupled Receptor (GPCR)
Mol. Mass.:
52868.96
Organism:
Homo sapiens (Human)
Description:
P21554
Residue:
472
  
Inhibitor
Name:
BDBM260034
Synonyms:
US9512141, 32
Type:
Small organic molecule
Emp. Form.:
C16H19F5N4O2
Mol. Mass.:
394.3397
SMILES:
CC1(C)CCCN1C(=O)c1cnc(N2CC(F)(F)C2)c(OCC(F)(F)F)n1
: