Target
Cannabinoid receptor 1
Ligand
BDBM260035
Substrate
Meas. Tech.
cAMP Assay
Temperature
310.15±n/a K
EC50
>10000±n/a nM
Comments
extracted
Citation
 Dhurwasulu, BGrether, UNettekoven, MRoever, SRogers-Evans, MSchulz-Gasch, T Pyrazine derivatives as CB2 receptor agonists US Patent  US9512141 Publication Date 12/6/2016 
Target
Name:
Cannabinoid receptor 1
Synonyms:
CANN6 CB-R CNR CNR1_HUMAN Cannabinoid receptor Cannabinoid receptor 1 (brain)
Type:
G Protein-Coupled Receptor (GPCR)
Mol. Mass.:
52868.96
Organism:
Homo sapiens (Human)
Description:
P21554
Residue:
472
  
Inhibitor
Name:
BDBM260035
Synonyms:
US9512141, 33
Type:
Small organic molecule
Emp. Form.:
C18H23F2N5O3
Mol. Mass.:
395.4037
SMILES:
NC(=O)C1CCCCN1C(=O)c1cnc(N2CC(F)(F)C2)c(OCC2CC2)n1
: