Target
Histamine H4 receptor
Ligand
BDBM294413
Substrate
Meas. Tech.
HotSpot Assay
pH
7.5±n/a
Temperature
298.15±n/a K
IC50
360±n/a nM
Comments
extracted
Citation
 Ho, PSYoon, DOHan, SYLee, WIKim, JSPark, WSAhn, SOKim, HJ Substituted tricyclic heterocycles as histamine 4 receptor inhibitors US Patent  US9586959 Publication Date 3/7/2017 
Target
Name:
Histamine H4 receptor
Synonyms:
AXOR35 GPCR105 HH4R HRH4 Histamine H4 receptor Histamine receptor (H3 and H4) SP9144
Type:
G Protein-Coupled Receptor (GPCR)
Mol. Mass.:
44517.02
Organism:
Homo sapiens (Human)
Description:
Binding assays were using CHO cells stably expressing hH4R receptors.
Residue:
390
  
Inhibitor
Name:
BDBM294413
Synonyms:
US9586959, Compound 89
Type:
Small organic molecule
Emp. Form.:
C13H13BrN6
Mol. Mass.:
333.187
SMILES:
CNC1CN(C1)c1nc2ncc(Br)cc2n2ccnc12
: