Target
Histamine H3 receptor
Ligand
BDBM294362
Substrate
Meas. Tech.
Binding Assay
pH
7.4±n/a
Temperature
300.15±n/a K
IC50
>100000000±n/a nM
Comments
extracted
Citation
 Ho, PSYoon, DOHan, SYLee, WIKim, JSPark, WSAhn, SOKim, HJ Substituted tricyclic heterocycles as histamine 4 receptor inhibitors US Patent  US9586959 Publication Date 3/7/2017 
Target
Name:
Histamine H3 receptor
Synonyms:
G-protein coupled receptor 97 HH3R HRH3 Histamine H3 receptor (H3) Histamine receptor (H3 and H4)
Type:
G Protein-Coupled Receptor (GPCR)
Mol. Mass.:
48691.47
Organism:
Homo sapiens (Human)
Description:
Binding assays were using CHO cells stably expressing hH3R receptors.
Residue:
445
  
Inhibitor
Name:
BDBM294362
Synonyms:
US9586959, Compound 7
Type:
Small organic molecule
Emp. Form.:
C12H12ClN7
Mol. Mass.:
289.724
SMILES:
Clc1cnc2nc(N3CCNCC3)c3nncn3c2c1
: