Target
Phosphatidylinositol 3,4,5-trisphosphate 5-phosphatase 2
Ligand
BDBM260047
Substrate
Meas. Tech.
Inhibition Assay
pH
7±n/a
IC50
12600±2800 nM
Comments
extracted
Citation
 Zhang, ZZeng, L Hydroxyindole carboxylic acid based inhibitors for oncogenic Src homology-2 domain containing protein tyrosine phosphatase-2 (SHP2) US Patent  US9522881 Publication Date 12/20/2016 
Target
Name:
Phosphatidylinositol 3,4,5-trisphosphate 5-phosphatase 2
Synonyms:
INPPL-1 Inositol polyphosphate phosphatase-like protein 1 Protein 51C SHIP-2 SHIP2_HUMAN | Src homology-2 domain containing protein tyrosine phosphatase-2 (SHP2)
Type:
Enzyme
Mol. Mass.:
138596.65
Organism:
Homo sapiens (Human)
Description:
O15357
Residue:
1258
  
Inhibitor
Name:
BDBM260047
Synonyms:
US9522881, 7'a-2 (L89N79)
Type:
Small organic molecule
Emp. Form.:
C22H21IN2O6
Mol. Mass.:
536.3164
SMILES:
Cn1c(CCCC(=O)NCc2ccc3OCOc3c2)c(I)c2cc(C(O)=O)c(O)cc12
: