Target
Phosphatidylinositol 3,4,5-trisphosphate 5-phosphatase 2
Ligand
BDBM50054256
Substrate
Meas. Tech.
Inhibition Assay
pH
7±n/a
IC50
5420±1010 nM
Comments
extracted
Citation
 Zhang, ZZeng, L Hydroxyindole carboxylic acid based inhibitors for oncogenic Src homology-2 domain containing protein tyrosine phosphatase-2 (SHP2) US Patent  US9522881 Publication Date 12/20/2016 
Target
Name:
Phosphatidylinositol 3,4,5-trisphosphate 5-phosphatase 2
Synonyms:
INPPL-1 Inositol polyphosphate phosphatase-like protein 1 Protein 51C SHIP-2 SHIP2_HUMAN | Src homology-2 domain containing protein tyrosine phosphatase-2 (SHP2)
Type:
Enzyme
Mol. Mass.:
138596.65
Organism:
Homo sapiens (Human)
Description:
O15357
Residue:
1258
  
Inhibitor
Name:
BDBM50054256
Synonyms:
CHEMBL3319375 US9844535, ID 11a-20 (L97M23)
Type:
Small organic molecule
Emp. Form.:
C24H17I2N3O5
Mol. Mass.:
681.2178
SMILES:
Cn1c(c(I)c2cc(C(O)=O)c(O)cc12)-c1cccc(NC(=O)C(=O)Nc2cccc(I)c2)c1
: