Target
Cannabinoid receptor 2
Ligand
BDBM260099
Substrate
Meas. Tech.
cAMP Assay
Temperature
310.15±n/a K
EC50
793.2±n/a nM
Comments
extracted
Citation
 Frei, BGobbi, LGrether, UKimbara, ANettekoven, MRoever, SRogers-Evans, MSchulz-Gasch, T Pyridine derivatives US Patent  US9522886 Publication Date 12/20/2016 
Target
Name:
Cannabinoid receptor 2
Synonyms:
CANNABINOID CB2 CB2 CB2B CNR2_HUMAN Cannabinoid CB2 receptor Cannabinoid receptor 2 (CB2R) | hCB2
Type:
G Protein-Coupled Receptor (GPCR)
Mol. Mass.:
39690.94
Organism:
Homo sapiens (Human)
Description:
P34972
Residue:
360
  
Inhibitor
Name:
BDBM260099
Synonyms:
US9522886, 47
Type:
Small organic molecule
Emp. Form.:
C15H18ClN3O4
Mol. Mass.:
339.774
SMILES:
NC(=O)CC1(COC1)NC(=O)c1ccc(OCC2CC2)c(Cl)n1
: