Target
Cannabinoid receptor 1
Ligand
BDBM260078
Substrate
Meas. Tech.
cAMP Assay
Temperature
310.15±n/a K
EC50
>10000±n/a nM
Comments
extracted
Citation
 Frei, BGobbi, LGrether, UKimbara, ANettekoven, MRoever, SRogers-Evans, MSchulz-Gasch, T Pyridine derivatives US Patent  US9522886 Publication Date 12/20/2016 
Target
Name:
Cannabinoid receptor 1
Synonyms:
CANN6 CB-R CNR CNR1_HUMAN Cannabinoid receptor Cannabinoid receptor 1 (brain)
Type:
G Protein-Coupled Receptor (GPCR)
Mol. Mass.:
52868.96
Organism:
Homo sapiens (Human)
Description:
P21554
Residue:
472
  
Inhibitor
Name:
BDBM260078
Synonyms:
US9522886, 26
Type:
Small organic molecule
Emp. Form.:
C18H22F2N4O4
Mol. Mass.:
396.3885
SMILES:
NC(=O)CC1(COC1)NC(=O)c1ccc(N2CC(F)(F)C2)c(OCC2CC2)n1
: