Target
Cannabinoid receptor 1
Ligand
BDBM260142
Substrate
Meas. Tech.
cAMP Assay
Temperature
310.15±n/a K
EC50
>10000±n/a nM
Comments
extracted
Citation
 Frei, BGobbi, LGrether, UKimbara, ANettekoven, MRoever, SRogers-Evans, MSchulz-Gasch, T Pyridine derivatives US Patent  US9522886 Publication Date 12/20/2016 
Target
Name:
Cannabinoid receptor 1
Synonyms:
CANN6 CB-R CNR CNR1_HUMAN Cannabinoid receptor Cannabinoid receptor 1 (brain)
Type:
G Protein-Coupled Receptor (GPCR)
Mol. Mass.:
52868.96
Organism:
Homo sapiens (Human)
Description:
P21554
Residue:
472
  
Inhibitor
Name:
BDBM260142
Synonyms:
US9522886, 90
Type:
Small organic molecule
Emp. Form.:
C19H25N3O5
Mol. Mass.:
375.4189
SMILES:
NC(=O)CC1(COC1)NC(=O)c1ccc(c(OCC2CC2)n1)C1(O)CCC1
: