Target
Vasopressin V1b receptor
Ligand
BDBM260219
Substrate
Meas. Tech.
Binding Assay
pH
7.4±n/a
Temperature
277.15±n/a K
IC50
3.2±n/a nM
Comments
extracted
Citation
 Yoshinaga, MKuwada, TMiyakoshi, NIshizaka, TWakasugi, DShirokawa, SHattori, NShimazaki, Y Azole derivative US Patent  US9522914 Publication Date 12/20/2016 
Target
Name:
Vasopressin V1b receptor
Synonyms:
AVPR V1b AVPR1B Antidiuretic hormone receptor 1b V1bR VPR3 Vasopressin V1b receptor (V1b) Vasopressin V3 receptor
Type:
Enzyme
Mol. Mass.:
46985.01
Organism:
Homo sapiens (Human)
Description:
P47901
Residue:
424
  
Inhibitor
Name:
BDBM260219
Synonyms:
US9522914, A-21
Type:
Small organic molecule
Emp. Form.:
C28H35FN4O2
Mol. Mass.:
478.6015
SMILES:
COc1cc(ccc1F)-c1nc(cn1CC(=O)NC(C)C)-c1ccc(CCN2CCC(C)C2)cc1
: