Target
Vasopressin V1b receptor
Ligand
BDBM260249
Substrate
Meas. Tech.
Binding Assay
pH
7.4±n/a
Temperature
277.15±n/a K
IC50
2.2±n/a nM
Comments
extracted
Citation
 Yoshinaga, MKuwada, TMiyakoshi, NIshizaka, TWakasugi, DShirokawa, SHattori, NShimazaki, Y Azole derivative US Patent  US9522914 Publication Date 12/20/2016 
Target
Name:
Vasopressin V1b receptor
Synonyms:
AVPR V1b AVPR1B Antidiuretic hormone receptor 1b V1bR VPR3 Vasopressin V1b receptor (V1b) Vasopressin V3 receptor
Type:
Enzyme
Mol. Mass.:
46985.01
Organism:
Homo sapiens (Human)
Description:
P47901
Residue:
424
  
Inhibitor
Name:
BDBM260249
Synonyms:
US9522914, B-02
Type:
Small organic molecule
Emp. Form.:
C25H30ClN5O2
Mol. Mass.:
467.991
SMILES:
CC(C)NC(=O)Cn1nc(nc1-c1cccc(Cl)c1)-c1ccc(CCN2CCOCC2)cc1
: