Target
Hexokinase-4
Ligand
BDBM260397
Substrate
Meas. Tech.
Glucokinase Activity Assay
EC50
18.6±n/a nM
Citation
 Lin, SParmee, ERXu, J 2-pyridinecarboxamide derivatives, compositions containing such compounds, and methods of treatment US Patent  US9527838 Publication Date 12/27/2016 
Target
Name:
Hexokinase-4
Synonyms:
FLAG-Glucokinase (GK)
Type:
Protein
Mol. Mass.:
Description:
Components:
This complex has 2 components.
Component 1
Name:
FLAG-tagged fusion protein
Synonyms:
Type:
Protein
Mol. Mass.:
1009.95
Organism:
Homo sapiens (Human)
Description:
Residue:
8
DYKDDDDK
  
Component 2
Name:
Hexokinase-4
Synonyms:
GCK Glucokinase (GK) HK IV HXK4_HUMAN Hexokinase-D
Type:
Enzyme
Mol. Mass.:
52175.81
Organism:
Homo sapiens (Human)
Description:
P35557
Residue:
465
  
Inhibitor
Name:
BDBM260397
Synonyms:
US9527838, 25
Type:
Small organic molecule
Emp. Form.:
C20H14ClFN6O3S3
Mol. Mass.:
537.01
SMILES:
Cn1cnnc1Sc1ccc(Sc2ccc(F)cc2)c(n1)C(=O)Nc1nc(CC(O)=O)c(Cl)s1
: