Target
Tyrosine-protein kinase JAK1
Ligand
BDBM260477
Substrate
Meas. Tech.
In Vitro Kinase Assay
pH
7.3±n/a
Temperature
300.15±n/a K
IC50
1±n/a nM
Comments
extracted
Citation
 Zhang, XDong, QLiu, BZhu, YLi, XLan, J Pyrrole six-membered heteroaryl ring derivative, preparation method thereof, and medicinal uses thereof US Patent  US9527851 Publication Date 12/27/2016 
Target
Name:
Tyrosine-protein kinase JAK1
Synonyms:
JAK-1 JAK1A JAK1_HUMAN Janus kinase 1 (JAK1) | Janus kinase 1 JAK1
Type:
Protein
Mol. Mass.:
133293.73
Organism:
Homo sapiens (Human)
Description:
P23458
Residue:
1154
  
Inhibitor
Name:
BDBM260477
Synonyms:
US10428074, Example 121 US9527851, 48 | US9527851, example 48
Type:
Small organic molecule
Emp. Form.:
C19H24N8OS
Mol. Mass.:
412.512
SMILES:
CCc1nsc(NC(=O)N2C[C@@H]3C[C@H](C[C@@H]3C2)N(C)c2ncnc3[nH]ccc23)n1
: