Target
Cyclin-dependent kinase 4/G1/S-specific cyclin-D1
Ligand
BDBM253913
Substrate
Meas. Tech.
Caliper Assay
IC50
1±n/a nM
Citation
 Strum, JCBisi, JERoberts, PJTavares, FX HSPC-sparing treatments for RB-positive abnormal cellular proliferation US Patent  US9527857 Publication Date 12/27/2016 
Target
Name:
Cyclin-dependent kinase 4/G1/S-specific cyclin-D1
Synonyms:
CDK4/CycD CDK4/Cyclin D1 Cyclin-Dependent Kinase 4 (CDK4) Cyclin-dependent kinase 4/G1/S-specific cyclin D1 | Cyclin-dependent kinase 4/cyclin D1
Type:
Protein Complex
Mol. Mass.:
Description:
CDK4/D1 complexes were purified from insect cells co-infected with baculovirus vectors containing each of the components.
Components:
This complex has 2 components.
Component 1
Name:
Cyclin-dependent kinase 4
Synonyms:
CDK4 Cell division protein kinase 4 PSK-J3
Type:
Enzyme Subunit
Mol. Mass.:
33731.96
Organism:
Homo sapiens (Human)
Description:
P11802
Residue:
303
  
Component 2
Name:
G1/S-specific cyclin-D1
Synonyms:
B-cell lymphoma 1 protein BCL-1 oncogene CCND1 PRAD1 | PRAD1 oncogene
Type:
Enzyme Subunit
Mol. Mass.:
33717.70
Organism:
Homo sapiens (Human)
Description:
Residue:
295
  
Inhibitor
Name:
BDBM253913
Synonyms:
US9464092, E | US9527857, E
Type:
Small organic molecule
Emp. Form.:
C26H34N8O
Mol. Mass.:
474.6012
SMILES:
CC(C)C1CN(CCN1)c1ccc(Nc2ncc3cc4C(=O)NCC5(CCCCC5)n4c3n2)nc1
: