Target
Tyrosine-protein kinase BTK
Ligand
BDBM260545
Substrate
Meas. Tech.
HTRF Assay
Temperature
298.15±n/a K
IC50
67±n/a nM
Comments
extracted
Citation
 He, W Polyfluorinated compounds acting as bruton tyrosine kinase inhibitors US Patent  US9532990 Publication Date 1/3/2017 
Target
Name:
Tyrosine-protein kinase BTK
Synonyms:
AGMX1 Agammaglobulinaemia tyrosine kinase B cell progenitor kinase BPK BTK_HUMAN Tyrosine Kinase BTK Tyrosine-protein kinase BTK (BTK)
Type:
Enzyme
Mol. Mass.:
76289.95
Organism:
Homo sapiens (Human)
Description:
Q06187
Residue:
659
  
Inhibitor
Name:
BDBM260545
Synonyms:
US10300066, Compound 19 | US9532990, 19
Type:
Small organic molecule
Emp. Form.:
C26H26FN7O4S
Mol. Mass.:
551.593
SMILES:
CS(=O)(=O)Nc1ccccc1Oc1ccc(-c2nn(C3CCCN(C3)C(=O)C=C)c3ncnc(N)c23)c(F)c1
: