Target
Tyrosine-protein kinase BTK
Ligand
BDBM260548
Substrate
Meas. Tech.
HTRF Assay
Temperature
298.15±n/a K
IC50
50±n/a nM
Comments
extracted
Citation
 He, W Polyfluorinated compounds acting as bruton tyrosine kinase inhibitors US Patent  US9532990 Publication Date 1/3/2017 
Target
Name:
Tyrosine-protein kinase BTK
Synonyms:
AGMX1 Agammaglobulinaemia tyrosine kinase B cell progenitor kinase BPK BTK_HUMAN Tyrosine Kinase BTK Tyrosine-protein kinase BTK (BTK)
Type:
Enzyme
Mol. Mass.:
76289.95
Organism:
Homo sapiens (Human)
Description:
Q06187
Residue:
659
  
Inhibitor
Name:
BDBM260548
Synonyms:
US10300066, Compound 22 | US9532990, 22
Type:
Small organic molecule
Emp. Form.:
C26H21F5N6O2
Mol. Mass.:
544.476
SMILES:
Nc1ncnc2n(nc(-c3ccc(Oc4c(F)c(F)cc(F)c4F)cc3F)c12)[C@@H]1CC[C@@H](CC1)NC(=O)C=C
: