Target
Tyrosine-protein kinase SYK
Ligand
BDBM260726
Substrate
Meas. Tech.
ADP-Glo Kinase Assay
IC50
12.4±n/a nM
Citation
 Whitlock, GAGlossop, PA Substituted pyrimidine-5-carboxamides as spleen tyrosine kinase inhibitors US Patent  US9533989 Publication Date 1/3/2017 
Target
Name:
Tyrosine-protein kinase SYK
Synonyms:
KSYK_HUMAN Spleen Tyrosine Kinase Tyrosine-protein kinase SYK (Syk)
Type:
Enzyme
Mol. Mass.:
72079.99
Organism:
Homo sapiens (Human)
Description:
P43405
Residue:
635
  
Inhibitor
Name:
BDBM260726
Synonyms:
US9533989, 36
Type:
Small organic molecule
Emp. Form.:
C22H29N7O3
Mol. Mass.:
439.5108
SMILES:
COC(=O)N1CCc2ccc(Nc3nc(N[C@@H]4CCCC[C@@H]4N)ncc3C(N)=O)cc2C1
: