Target
Tyrosine-protein kinase SYK
Ligand
BDBM260728
Substrate
Meas. Tech.
ADP-Glo Kinase Assay
IC50
14.9±n/a nM
Citation
 Whitlock, GAGlossop, PA Substituted pyrimidine-5-carboxamides as spleen tyrosine kinase inhibitors US Patent  US9533989 Publication Date 1/3/2017 
Target
Name:
Tyrosine-protein kinase SYK
Synonyms:
KSYK_HUMAN Spleen Tyrosine Kinase Tyrosine-protein kinase SYK (Syk)
Type:
Enzyme
Mol. Mass.:
72079.99
Organism:
Homo sapiens (Human)
Description:
P43405
Residue:
635
  
Inhibitor
Name:
BDBM260728
Synonyms:
US9533989, 38
Type:
Small organic molecule
Emp. Form.:
C23H31N7O3
Mol. Mass.:
453.5373
SMILES:
CCOC(=O)N1CCc2ccc(Nc3nc(N[C@@H]4CCCC[C@@H]4N)ncc3C(N)=O)cc2C1
: