Target
Tyrosine-protein kinase SYK
Ligand
BDBM260808
Substrate
Meas. Tech.
ADP-Glo Kinase Assay
IC50
267±n/a nM
Citation
 Whitlock, GAGlossop, PA Substituted pyrimidine-5-carboxamides as spleen tyrosine kinase inhibitors US Patent  US9533989 Publication Date 1/3/2017 
Target
Name:
Tyrosine-protein kinase SYK
Synonyms:
KSYK_HUMAN Spleen Tyrosine Kinase Tyrosine-protein kinase SYK (Syk)
Type:
Enzyme
Mol. Mass.:
72079.99
Organism:
Homo sapiens (Human)
Description:
P43405
Residue:
635
  
Inhibitor
Name:
BDBM260808
Synonyms:
US9533989, 119
Type:
Small organic molecule
Emp. Form.:
C23H26N6OS
Mol. Mass.:
434.557
SMILES:
N[C@H]1CCCC[C@H]1Nc1ncc(C(N)=O)c(Nc2ccc(Sc3ccccc3)cc2)n1
: