Target
High affinity cGMP-specific 3',5'-cyclic phosphodiesterase 9A
Ligand
BDBM247231
Substrate
Meas. Tech.
Inhibition Assay
pH
7.6±n/a
Temperature
298.15±n/a K
IC50
150±n/a nM
Comments
extracted
Citation
 Svenstrup, NSimonsen, KBRasmussen, LKJuhl, KLanggård, MWen, KWang, Y PDE9 inhibitors with imidazo triazinone backbone US Patent  US9533992 Publication Date 1/3/2017 
Target
Name:
High affinity cGMP-specific 3',5'-cyclic phosphodiesterase 9A
Synonyms:
3',5'-cyclic phosphodiesterase PDE9A_HUMAN Phosphodiesterase 9A (PDE9) | Phosphodiesterase 9A (PDE9A)
Type:
Protein
Mol. Mass.:
68488.40
Organism:
Homo sapiens (Human)
Description:
O76083
Residue:
593
  
Inhibitor
Name:
BDBM247231
Synonyms:
US9434733, 2-[[3-(p-tolylmethoxy)azetidin-1-yl]methyl]-7-tetrahydropyran-4-yl-3H-imidazo[5,1-f][1,2,4]triazin-4-one | US9533992, 2-[[3-(p-tolylmethoxy)azetidin-1-yl]methyl]-7-tetrahydropyran-4-yl-3H-imidazo[5,1-f][1,2,4]triazin-4-one
Type:
Small organic molecule
Emp. Form.:
C22H27N5O3
Mol. Mass.:
409.4815
SMILES:
Cc1ccc(COC2CN(Cc3nn4c(ncc4c(=O)[nH]3)C3CCOCC3)C2)cc1
: