Target
D-amino-acid oxidase
Ligand
BDBM406232
Substrate
Meas. Tech.
In Vitro Measurements of human D-Amino Acid Oxidase (DAAO) Activities
IC50
550±n/a nM
Citation
 Tsai, GEWang, CHsieh, Y D-amino acid oxidase inhibitors and therapeutic uses thereof US Patent  US10336724 Publication Date 7/2/2019 
Target
Name:
D-amino-acid oxidase
Synonyms:
D-amino-acid oxidase (DAAO) DAMOX OXDA_HUMAN
Type:
Homodimer
Mol. Mass.:
39476.06
Organism:
Homo sapiens (Human)
Description:
P14920
Residue:
347
  
Inhibitor
Name:
BDBM406232
Synonyms:
6-(naphthalen-1-ylmethyl)-3-oxo-2,3-dihydropyridazin-4-yl 3-phenethyl-1H-pyrazole-5-carboxylate | US10336724, Compound 62
Type:
Small organic molecule
Emp. Form.:
C27H22N4O3
Mol. Mass.:
450.4886
SMILES:
O=C(Oc1cc(Cc2cccc3ccccc23)n[nH]c1=O)c1cc(CCc2ccccc2)n[nH]1
: