Target
Lysine-specific demethylase 5B
Ligand
BDBM277735
Substrate
Meas. Tech.
Jarid1B Assay
IC50
<100±n/a nM
Citation
 Kanouni, TStafford, JAVeal, JMWallace, MB Histone demethylase inhibitors US Patent  US10336727 Publication Date 7/2/2019 
Target
Name:
Lysine-specific demethylase 5B
Synonyms:
CT31 Histone demethylase JARID1B Jumonji/ARID domain-containing protein 1B KDM5B_HUMAN Lysine-specific demethylase 5B (KDM5Flag-5B-FL) PLU1 RBP2-H1 | Retinoblastoma-binding protein 2 homolog 1
Type:
Protein
Mol. Mass.:
175659.67
Organism:
Homo sapiens (Human)
Description:
Q9UGL1
Residue:
1544
  
Inhibitor
Name:
BDBM277735
Synonyms:
3-{[5-fluoro-1-(3,3,3-trifluoropropyl)-1H-indazol-3-yl]amino}pyridine-4-carboxylic acid US10336727, Example 32 | US9617242, Example 32
Type:
Small organic molecule
Emp. Form.:
C16H12F4N4O2
Mol. Mass.:
368.2857
SMILES:
OC(=O)c1ccncc1Nc1nn(CCC(F)(F)F)c2ccc(F)cc12
: