Target
Membrane primary amine oxidase
Ligand
BDBM406241
Substrate
Meas. Tech.
Biochemical Assay
IC50
6.00±n/a nM
Citation
 Himmelsbach, FBlum, APeters, S 4-cyano-benzyl carbamimidoylcarbamate derivatives and their use as AOC3 inhibitors US Patent  US10336729 Publication Date 7/2/2019 
Target
Name:
Membrane primary amine oxidase
Synonyms:
AOC3 Amine oxidase, copper containing Semicarbazide-sensitive amine oxidase/ Vascular adhesion protein 1 (SSAO/VAP-1) Vascular adhesion protein 1 (VAP-1)
Type:
Protein
Mol. Mass.:
84620.86
Organism:
Homo sapiens (Human)
Description:
Q16853
Residue:
763
  
Inhibitor
Name:
BDBM406241
Synonyms:
US10336729, # 1.002
Type:
Small organic molecule
Emp. Form.:
C21H23FN6O4S
Mol. Mass.:
474.509
SMILES:
CS(=O)(=O)c1ccc(cc1)N1CCN(CC1)c1c(F)c(COC(=O)NC(N)=N)ccc1C#N
: