Target
Membrane primary amine oxidase
Ligand
BDBM406265
Substrate
Meas. Tech.
Biochemical Assay
IC50
17.0±n/a nM
Citation
 Himmelsbach, FBlum, APeters, S 4-cyano-benzyl carbamimidoylcarbamate derivatives and their use as AOC3 inhibitors US Patent  US10336729 Publication Date 7/2/2019 
Target
Name:
Membrane primary amine oxidase
Synonyms:
AOC3 Amine oxidase, copper containing Semicarbazide-sensitive amine oxidase/ Vascular adhesion protein 1 (SSAO/VAP-1) Vascular adhesion protein 1 (VAP-1)
Type:
Protein
Mol. Mass.:
84620.86
Organism:
Homo sapiens (Human)
Description:
Q16853
Residue:
763
  
Inhibitor
Name:
BDBM406265
Synonyms:
US10336729, # 1.019
Type:
Small organic molecule
Emp. Form.:
C19H19FN6O2
Mol. Mass.:
382.3916
SMILES:
NC(=N)NC(=O)OCc1ccc(C#N)c(N2CCC(C2)c2ccncc2)c1F
: