Target
Membrane primary amine oxidase
Ligand
BDBM406298
Substrate
Meas. Tech.
Biochemical Assay
IC50
146±n/a nM
Citation
 Himmelsbach, FBlum, APeters, S 4-cyano-benzyl carbamimidoylcarbamate derivatives and their use as AOC3 inhibitors US Patent  US10336729 Publication Date 7/2/2019 
Target
Name:
Membrane primary amine oxidase
Synonyms:
AOC3 Amine oxidase, copper containing Semicarbazide-sensitive amine oxidase/ Vascular adhesion protein 1 (SSAO/VAP-1) Vascular adhesion protein 1 (VAP-1)
Type:
Protein
Mol. Mass.:
84620.86
Organism:
Homo sapiens (Human)
Description:
Q16853
Residue:
763
  
Inhibitor
Name:
BDBM406298
Synonyms:
US10336729, # 1.052
Type:
Small organic molecule
Emp. Form.:
C22H25FN6O2
Mol. Mass.:
424.4713
SMILES:
Cc1cc(C)cc(c1)N1CCN(CC1)c1c(F)c(COC(=O)NC(N)=N)ccc1C#N
: