Target
Membrane primary amine oxidase
Ligand
BDBM406341
Substrate
Meas. Tech.
Biochemical Assay
IC50
33.0±n/a nM
Citation
 Himmelsbach, FBlum, APeters, S 4-cyano-benzyl carbamimidoylcarbamate derivatives and their use as AOC3 inhibitors US Patent  US10336729 Publication Date 7/2/2019 
Target
Name:
Membrane primary amine oxidase
Synonyms:
AOC3 Amine oxidase, copper containing Semicarbazide-sensitive amine oxidase/ Vascular adhesion protein 1 (SSAO/VAP-1) Vascular adhesion protein 1 (VAP-1)
Type:
Protein
Mol. Mass.:
84620.86
Organism:
Homo sapiens (Human)
Description:
Q16853
Residue:
763
  
Inhibitor
Name:
BDBM406341
Synonyms:
US10336729, # 2.006
Type:
Small organic molecule
Emp. Form.:
C17H18FN7O3
Mol. Mass.:
387.3683
SMILES:
NC(=N)NC(=O)OCc1ccc(C#N)c(N2CCC(CC2)c2nnco2)c1F
: