Target
Leukotriene B4 receptor 1
Ligand
BDBM406357
Substrate
Meas. Tech.
BLT-1 cAMP Assay
EC50
650±n/a nM
Citation
 Han, YLim, JTummanapalli, SSiliphaivanh, PSpencer, K Aryl acylsulfonamides as BLT1 antagonists US Patent  US10336733 Publication Date 7/2/2019 
Target
Name:
Leukotriene B4 receptor 1
Synonyms:
BLT BLTR Chemoattractant receptor-like 1 GPR16 LTB4-R 1 Leukotriene B4 R1 Leukotriene B4 receptor 1 P2Y purinoceptor 7 | P2Y7
Type:
Enzyme Catalytic Domain
Mol. Mass.:
37582.68
Organism:
Homo sapiens (Human)
Description:
Q15722
Residue:
352
  
Inhibitor
Name:
BDBM406357
Synonyms:
4-Fluoro-2-((3R,4S or 3S,4R)-4-hydroxy-3-(pyridin-2-ylmethyl)chroman-7-yl)-N-((trifluoromethyl)sulfonyl)benzamide | US10336733, Example 1
Type:
Small organic molecule
Emp. Form.:
C23H18F4N2O5S
Mol. Mass.:
510.458
SMILES:
O[C@H]1[C@H](Cc2ccccn2)COc2cc(ccc12)-c1cc(F)ccc1C(=O)NS(=O)(=O)C(F)(F)F
: