Target
Leukotriene B4 receptor 1
Ligand
BDBM406376
Substrate
Meas. Tech.
BLT-1 cAMP Assay
EC50
44.0±n/a nM
Citation
 Han, YLim, JTummanapalli, SSiliphaivanh, PSpencer, K Aryl acylsulfonamides as BLT1 antagonists US Patent  US10336733 Publication Date 7/2/2019 
Target
Name:
Leukotriene B4 receptor 1
Synonyms:
BLT BLTR Chemoattractant receptor-like 1 GPR16 LTB4-R 1 Leukotriene B4 R1 Leukotriene B4 receptor 1 P2Y purinoceptor 7 | P2Y7
Type:
Enzyme Catalytic Domain
Mol. Mass.:
37582.68
Organism:
Homo sapiens (Human)
Description:
Q15722
Residue:
352
  
Inhibitor
Name:
BDBM406376
Synonyms:
2-((3,4-trans)-4-Hydroxy-3-(pyridin-2-ylmethyl)chroman-7-yl)-N-(neopentylsulfonyl)benzamide | US10336733, Example 20
Type:
Small organic molecule
Emp. Form.:
C27H30N2O5S
Mol. Mass.:
494.603
SMILES:
CC(C)(C)CS(=O)(=O)NC(=O)c1ccccc1-c1ccc2C(O)C(Cc3ccccn3)COc2c1
: