Target
Leukotriene B4 receptor 1
Ligand
BDBM406381
Substrate
Meas. Tech.
BLT-1 cAMP Assay
EC50
16.0±n/a nM
Citation
 Han, YLim, JTummanapalli, SSiliphaivanh, PSpencer, K Aryl acylsulfonamides as BLT1 antagonists US Patent  US10336733 Publication Date 7/2/2019 
Target
Name:
Leukotriene B4 receptor 1
Synonyms:
BLT BLTR Chemoattractant receptor-like 1 GPR16 LTB4-R 1 Leukotriene B4 R1 Leukotriene B4 receptor 1 P2Y purinoceptor 7 | P2Y7
Type:
Enzyme Catalytic Domain
Mol. Mass.:
37582.68
Organism:
Homo sapiens (Human)
Description:
Q15722
Residue:
352
  
Inhibitor
Name:
BDBM406381
Synonyms:
US10336733, Example 25
Type:
Small organic molecule
Emp. Form.:
C24H24N2O5S2
Mol. Mass.:
484.588
SMILES:
CC1(CC1)S(=O)(=O)NC(=O)c1ccccc1-c1ccc2[C@H](O)[C@@H](Cc3cscn3)COc2c1
: