Target
Rho-associated protein kinase 2
Ligand
BDBM14027
Substrate
Meas. Tech.
Fluorescent Polarization Assay
Temperature
296.15±n/a K
IC50
820±40 nM
Comments
extracted
Citation
 McKerracher, LBond, LM Treatment of cerebral cavernous malformations and cerebral aneurysms with Rho kinase inhibitors US Patent  US9687483 Publication Date 6/27/2017 
Target
Name:
Rho-associated protein kinase 2
Synonyms:
ROCK2_RAT Rho-associated protein kinase 2 Rho-associated, coiled-coil-containing protein kinase 2 RhoA-binding kinase 2 p150 ROK-alpha
Type:
Protein
Mol. Mass.:
160370.90
Organism:
Rattus norvegicus (Rat)
Description:
Q62868
Residue:
1388
  
Inhibitor
Name:
BDBM14027
Synonyms:
5-(1,4-diazepan-1-ylsulfonyl)isoquinoline AT877 CHEMBL541388 HA-1077 cid_163751
Type:
Small organic molecule
Emp. Form.:
C14H17N3O2S
Mol. Mass.:
291.369
SMILES:
O=S(=O)(N1CCCNCC1)c1cccc2cnccc12
: