Target
Apelin receptor
Ligand
BDBM406421
Substrate
Meas. Tech.
Intracellular cAMP Accumulation Assay
EC50
55±n/a nM
Citation
 Johnson, JAKim, S 4-hydroxy-3-(heteroaryl)pyridine-2-one APJ agonists US Patent  US10336739 Publication Date 7/2/2019 
Target
Name:
Apelin receptor
Synonyms:
AGTRL1 APJ_HUMAN Angiotensin receptor-like 1 Apelin receptor (APJ) G-protein coupled receptor HG11
Type:
Enzyme Catalytic Domain
Mol. Mass.:
42664.06
Organism:
Homo sapiens (Human)
Description:
P35414
Residue:
380
  
Inhibitor
Name:
BDBM406421
Synonyms:
6-butyl-5-(2,6- dimethoxyphenyl)- 3-[5-(1- phenylcyclopropyl)- 1,3,4-oxadiazol-2- yl]pyridine-2,4-diol | US10336739, Example 13
Type:
Small organic molecule
Emp. Form.:
C28H29N3O5
Mol. Mass.:
487.547
SMILES:
CCCCc1nc(O)c(-c2nnc(o2)C2(CC2)c2ccccc2)c(O)c1-c1c(OC)cccc1OC
: