Target
Apelin receptor
Ligand
BDBM406501
Substrate
Meas. Tech.
Intracellular cAMP Accumulation Assay
EC50
55±n/a nM
Citation
 Johnson, JAKim, S 4-hydroxy-3-(heteroaryl)pyridine-2-one APJ agonists US Patent  US10336739 Publication Date 7/2/2019 
Target
Name:
Apelin receptor
Synonyms:
AGTRL1 APJ_HUMAN Angiotensin receptor-like 1 Apelin receptor (APJ) G-protein coupled receptor HG11
Type:
Enzyme Catalytic Domain
Mol. Mass.:
42664.06
Organism:
Homo sapiens (Human)
Description:
P35414
Residue:
380
  
Inhibitor
Name:
BDBM406501
Synonyms:
6-cyclopropyl-5- (2,6- dimethoxyphenyl) 3-{5-[(2-methyl- 1,3-thiazol-4- yl)methyl]-1,3,4- oxadiazol-2- yl}pyridine-2,4-diol | US10336739, Example 94
Type:
Small organic molecule
Emp. Form.:
C23H22N4O5S
Mol. Mass.:
466.51
SMILES:
COc1cccc(OC)c1-c1c(O)c(-c2nnc(Cc3csc(C)n3)o2)c(O)nc1C1CC1
: